{"text_format":"1","workbook":"xlsx","n_sheets":11,"sheets":["Model Description","Summary","Authorized Rev Req","Incremental Rev Req","SAR and RAR","Res Bill Impact","Hypothetical Summary","Hypothetical SAR and RAR","Hypothetical Res Bill Impact","SetUp","Selected Data"],"not_rendered":{"charts":0,"images":0,"macros":1,"external_links":0,"defined_names":252,"comments":0,"pivot_tables":0},"unopened":[],"bounds":{"document_bytes":16777216,"sheet_cells":100000,"rows_first":2000,"rows_last":500,"rows_between":2000,"halvings":0,"cell_chars":16384,"cell_head_chars":4096},"cells_cut":0,"cells_raw":0,"read":"whole","date_system":"1900"}

{"sheet":"Model Description","index":0,"n_rows":14,"n_cols":3,"rows_kept":14,"cut":false,"hidden":false,"merged":[]}
[]
[null,"Tab","Description"]
[null,"Summary","This tab allows the user to input the year, baseline region, and other assumptions. Includes outputs of average bills for current and inputted year."]
[null,null,"Bundled represents customers that we procure gas for. System refers to all customer classes combined. Total System for a customer class includes Bundled + Unbundled. "]
[null,"Authorized Rev Req","This tab shows the authorized revenue requirement for each line item that is in existing rates."]
[null,"Incremental Rev Req","This tab contains several sections: (i) Approved Application(s), (ii) Pending Application(s) Not Yet Approved, and (iii) Applications Projected to be Filed. "]
[null,null,"The Approved Application(s) section shows the authorized revenue requirement for each line item forecasted out by year."]
[null,null,"The Pending Application(s) Not Yet Approved section includes pending advice letters or applications for new proceedings and any pending increases or decreases to current line items."]
{"$rows_left_out":7}
{"sheet":"Summary","index":1,"n_rows":85,"n_cols":20,"rows_kept":85,"cut":false,"hidden":false,"merged":[[53,1,53,2],[55,1,55,9],[57,1,57,2],[58,1,58,2],[59,1,59,2],[37,13,37,14],[37,15,37,16],[49,1,49,9],[51,1,51,2],[52,1,52,2],[61,1,61,9],[63,1,63,2],[64,1,64,2],[75,13,75,14],[75,15,75,16],[65,1,65,2],[82,1,82,2],[84,1,84,2],[68,1,68,9],[70,1,70,2],[72,1,72,2],[74,1,74,9],[76,1,76,2],[80,1,80,9],[78,1,78,2],[34,1,34,2],[36,1,36,9],[38,1,38,2],[46,1,46,2],[39,1,39,2],[40,1,40,2],[42,1,42,9],[44,1,44,2],[45,1,45,2],[30,1,30,9],[32,1,32,2],[33,1,33,2],[28,11,28,19],[25,1,25,2],[29,11,29,12],[26,1,26,2],[16,11,16,12],[25,11,25,12],[26,11,26,12],[24,11,24,19],[27,1,27,2],[27,11,27,12],[24,1,24,9]]}
[null,"Inputs:",null,null,null,null,"Assumptions:"]
[null,null,{"$f":"CONCATENATE(\"Rate Impact for Year (\",SetUp!J5,\"-\",SetUp!J9,\")\")","v":"Rate Impact for Year (2026-2030)"},2026,null,null,"Current Effective Rates",null,{"$f":"CurrentEffectiveRateDate","v":"2026-01-01"}]
[null,null,"Baseline Region - (Residential bill)","SDG&E",null,null,"Sales Forecast",null,2024]
[null,null,null,null,null,null,"Residential bill calculated using ",null,"Schedule GR, Basic, Bundled, Single Family"]
[null,null,null,null,null,null,"Non-CARE bill impact calculated with average summer usage of ",null,null,null,{"$f":"IF($D$3=\"ALL\",SUMPRODUCT('Res Bill Impact'!Q22:Q25,'Res Bill Impact'!U22:U25),VLOOKUP($D$3,'Res Bill Impact'!$P$22:$T$25,2,FALSE))","v":15},"therms per month"]
[null,"Pending Proceedings",null,"Include in Impact (Y)","Applicable Year(s)",null,"Non-CARE bill impact calculated with average winter usage of ",null,null,null,{"$f":"IF($D$3=\"ALL\",SUMPRODUCT('Res Bill Impact'!R22:R25,'Res Bill Impact'!U22:U25),VLOOKUP(D$3,'Res Bill Impact'!$P$22:$T$25,3,FALSE))","v":29},"therms per month"]
[null,{"$f":"'Incremental Rev Req'!A97","v":"2024 GRC Track 3 (PSEP and WMPMA)"},null,"Y","2026-2027",null,"CARE bill impact calculated with average summer usage of ",null,null,null,{"$f":"IF($D$3=\"ALL\",SUMPRODUCT('Res Bill Impact'!S22:S25,'Res Bill Impact'!V22:V25),VLOOKUP($D$3,'Res Bill Impact'!$P$22:$T$25,4,FALSE))","v":14.833333333333334},"therms per month"]
[null,{"$f":"'Incremental Rev Req'!A98","v":"GRC PFM"},null,"Y","2025-2027",null,"CARE bill impact calculated with average winter usage of ",null,null,null,{"$f":"IF($D$3=\"ALL\",SUMPRODUCT('Res Bill Impact'!T22:T25,'Res Bill Impact'!V22:V25),VLOOKUP($D$3,'Res Bill Impact'!$P$22:$T$25,5,FALSE))","v":24.666666666666668},"therms per month"]
{"$rows_left_out":78}
{"sheet":"Authorized Rev Req","index":2,"n_rows":97,"n_cols":18,"rows_kept":97,"cut":false,"hidden":false,"merged":[]}
[]
["Annual Period 2025"]
["Reporting Date: Quarter Ended March 31"]
[]
[null,"Revenue Requirement Date:","2022-01-01","2023-01-01","2023-03-01","2023-08-01","2023-11-01","2024-01-01","2024-07-01","2024-10-01","2025-01-01","2025-02-01","2025-07-01","2025-09-01","2025-10-01","2026-01-01"]
[null,"Advice Letter:","AL 3046-G","AL 3149-G","AL 3163-G","AL 3213-G","AL 3244-G","AL 3261-G","AL 3312-G","AL-3345-G","AL-3383-G","AL-3392-G-A"," AL-3431-G","AL-3447-G","AL-3457-G","AL-3438-G"]
["Filing Description","Authority for Revenue Requirement as of 10/01/2025","Authorized Revenue Requirement       ($000) ","Authorized Revenue Requirement       ($000) ","Authorized Revenue Requirement       ($000) ","Authorized Revenue Requirement       ($000) ","Authorized Revenue Requirement       ($000) ","Authorized Revenue Requirement       ($000) ","Authorized Revenue Requirement       ($000) ","Authorized Revenue Requirement       ($000) ","Authorized Revenue Requirement       ($000) ","Authorized Revenue Requirement       ($000) ","Authorized Revenue Requirement       ($000) ","Authorized Revenue Requirement       ($000) ","Authorized Revenue Requirement       ($000) ","Authorized Revenue Requirement       ($000) ","Revenue Recovery Mechanism","Balancing Account "]
["Safety Affordability Reliability Proceedings"]
{"$rows_left_out":90}
{"sheet":"Incremental Rev Req","index":3,"n_rows":129,"n_cols":19,"rows_kept":129,"cut":false,"hidden":false,"merged":[]}
[]
[{"$f":"'Authorized Rev Req'!A2","v":"Annual Period 2025"}]
["Reporting Date: Quarter Ended December 31"]
[]
["Current Revenue Requirement ($000):",{"$f":"'Authorized Rev Req'!O97","v":1012062.052750407}]
["Current Revenue Requirement Effective:","2025-10-01"]
["Approved Application(s), Implemented Since Jan 1 or To Be Implemented",null,null,null,null,null,null,null,null,null,null,null,null,"Authorized"]
["Filing Description","Proceeding","Authority for Revenue Requirement","Authorized Revenue Requirement with FF&U ($000)","Revenue Recovery Mechanism","Authorized Revenue Requirement with FF&U ($000) - Breakout by Year",null,null,null,null,"Existing or New Item (if existing, use delta from prior for rate impact)",null,null,null,{"$f":"TRANSPOSE(YearsForRateImpact)","v":2026},2027,2028,2029,2030]
{"$rows_left_out":122}
{"sheet":"SAR and RAR","index":4,"n_rows":34,"n_cols":30,"rows_kept":34,"cut":false,"hidden":false,"merged":[[15,25,16,25],[31,5,31,7],[36,20,36,21],[15,22,15,23],[16,22,16,23],[17,20,17,21],[18,20,18,21],[19,20,19,21],[17,22,17,23],[18,22,18,23],[19,22,19,23],[15,24,16,24],[46,20,46,21],[52,20,52,21],[0,2,0,3],[25,5,25,10],[71,20,71,21],[15,20,15,21],[16,20,16,21],[25,15,25,21],[64,20,64,21]]}
[null,null,"Revenue Change ($000)"]
[null,null,"Authorized","w/ Pending"]
[null,{"$f":"RevRecoveryMechanisms","v":"Core Procurement"},{"$f":"INDEX('Incremental Rev Req'!$N$9:$S$22,MATCH(B3,'Incremental Rev Req'!$N$9:$N$22,0),MATCH(Summary!$D$2,'Incremental Rev Req'!$N$8:$S$8,0))","v":164830.56995935214},{"$f":"INDEX('Incremental Rev Req'!$N$100:$S$113,MATCH(B3,'Incremental Rev Req'!$N$100:$N$113,0),MATCH(Summary!$D$2,'Incremental Rev Req'!$N$99:$S$99,0))","v":164830.56995935214},null,null,"Allocation",null,null,null,null,null,null,null,null,"Other Revenues and Balancing Accounts"]
[null,"Allocated Base Margin",{"$f":"INDEX('Incremental Rev Req'!$N$9:$S$22,MATCH(B4,'Incremental Rev Req'!$N$9:$N$22,0),MATCH(Summary!$D$2,'Incremental Rev Req'!$N$8:$S$8,0))","v":491182.11962129368},{"$f":"INDEX('Incremental Rev Req'!$N$100:$S$113,MATCH(B4,'Incremental Rev Req'!$N$100:$N$113,0),MATCH(Summary!$D$2,'Incremental Rev Req'!$N$99:$S$99,0))","v":491182.11962129368},null,null,{"$f":"TRANSPOSE(RevRecoveryMechanisms)","v":"Core Procurement"},"Allocated Base Margin","Distribution","All Residential","Local Transmission","Seasonal Storage","GHG End User","Public Purpose Programs","-","46% Res (LUAF, Other)","ECPT","EPAM","CFCA","Non-Residential","CPUC Fee"]
[null,"Distribution",{"$f":"INDEX('Incremental Rev Req'!$N$9:$S$22,MATCH(B5,'Incremental Rev Req'!$N$9:$N$22,0),MATCH(Summary!$D$2,'Incremental Rev Req'!$N$8:$S$8,0))","v":76412.12476454323},{"$f":"INDEX('Incremental Rev Req'!$N$100:$S$113,MATCH(B5,'Incremental Rev Req'!$N$100:$N$113,0),MATCH(Summary!$D$2,'Incremental Rev Req'!$N$99:$S$99,0))","v":76412.12476454323},null,"Residential",0.57246929564900972,0.81652373633254627,0.71351095116714947,1,0.51543343712031298,0.74052031744563351,0.49735087986604948,0.45465574087968463,null,0.43914119669235535,0.33016648110968039,0.81652373633254627,0.60198759162917603,0,{"$f":"RegulatoryFee","v":3.5000000000000001E-3}]
[null,"All Residential",{"$f":"INDEX('Incremental Rev Req'!$N$9:$S$22,MATCH(B6,'Incremental Rev Req'!$N$9:$N$22,0),MATCH(Summary!$D$2,'Incremental Rev Req'!$N$8:$S$8,0))","v":3351.4289792476015},{"$f":"INDEX('Incremental Rev Req'!$N$100:$S$113,MATCH(B6,'Incremental Rev Req'!$N$100:$N$113,0),MATCH(Summary!$D$2,'Incremental Rev Req'!$N$99:$S$99,0))","v":3351.4289792476015}]
[null,"Local Transmission",{"$f":"INDEX('Incremental Rev Req'!$N$9:$S$22,MATCH(B7,'Incremental Rev Req'!$N$9:$N$22,0),MATCH(Summary!$D$2,'Incremental Rev Req'!$N$8:$S$8,0))","v":2457.9829280886029},{"$f":"INDEX('Incremental Rev Req'!$N$100:$S$113,MATCH(B7,'Incremental Rev Req'!$N$100:$N$113,0),MATCH(Summary!$D$2,'Incremental Rev Req'!$N$99:$S$99,0))","v":2457.9829280886029},null,null,"Revenue Change ($000) - System"]
[null,"Seasonal Storage",{"$f":"INDEX('Incremental Rev Req'!$N$9:$S$22,MATCH(B8,'Incremental Rev Req'!$N$9:$N$22,0),MATCH(Summary!$D$2,'Incremental Rev Req'!$N$8:$S$8,0))","v":23067.973570493206},{"$f":"INDEX('Incremental Rev Req'!$N$100:$S$113,MATCH(B8,'Incremental Rev Req'!$N$100:$N$113,0),MATCH(Summary!$D$2,'Incremental Rev Req'!$N$99:$S$99,0))","v":23067.973570493206},null,"Authorized",{"$f":"TRANSPOSE(RevRecoveryMechanisms)","v":"Core Procurement"},"Allocated Base Margin","Distribution","All Residential","Local Transmission","Seasonal Storage","GHG End User","Public Purpose Programs","-","46% Res (LUAF, Other)","ECPT","EPAM","CFCA","Non-Residential"]
{"$rows_left_out":27}
{"sheet":"Res Bill Impact","index":5,"n_rows":97,"n_cols":25,"rows_kept":97,"cut":false,"hidden":false,"merged":[[49,2,49,9],[39,2,39,9],[40,2,40,3],[40,4,40,5],[40,6,40,7],[40,8,40,9],[1,1,1,3],[2,4,2,10],[2,15,2,21],[38,2,38,9],[60,2,60,3],[60,4,60,5],[60,6,60,7],[60,8,60,9],[19,20,19,21],[20,16,20,17],[20,18,20,19],[50,2,50,3],[50,4,50,5],[50,6,50,7],[50,8,50,9],[59,2,59,9],[69,2,69,9],[70,2,70,3],[70,4,70,5],[70,6,70,7],[70,8,70,9],[79,2,79,9],[80,2,80,3],[80,4,80,5],[80,6,80,7],[80,8,80,9],[89,2,89,9],[90,2,90,3],[90,4,90,5],[90,6,90,7],[90,8,90,9],[38,13,38,20],[39,13,39,20],[40,13,40,14],[40,15,40,16],[40,17,40,18],[40,19,40,20],[49,13,49,20],[50,13,50,14],[50,15,50,16],[50,17,50,18],[50,19,50,20],[70,17,70,18],[70,19,70,20],[59,13,59,20],[60,13,60,14],[60,15,60,16],[60,17,60,18],[60,19,60,20],[28,20,28,21],[29,16,29,17],[29,18,29,19],[89,13,89,20],[90,13,90,14],[90,15,90,16],[90,17,90,18],[90,19,90,20],[79,13,79,20],[80,13,80,14],[80,15,80,16],[80,17,80,18],[80,19,80,20],[69,13,69,20],[70,13,70,14],[70,15,70,16]]}
[]
[]
[null,null,null,null,"Schedule GR",null,null,null,null,null,null,null,null,null,null,"Schedule GR [CARE]"]
[null,null,null,null,{"$f":"SalesForecastYear","v":2024},{"$f":"CurrentEffectiveRateDate","v":"2026-01-01"},{"$f":"CurrentEffectiveRateDate","v":"2026-01-01"},"Proposed","Proposed","Proposed","Proposed",null,null,null,null,{"$f":"SalesForecastYear","v":2024},{"$f":"CurrentEffectiveRateDate","v":"2026-01-01"},{"$f":"CurrentEffectiveRateDate","v":"2026-01-01"},"Proposed","Proposed","Proposed","Proposed"]
[null,null,null,null,"System Sales Forecast","Rates","Revenue","Authorized Rates","Authorized Revenue","w/Pending Rates","w/Pending Revenue",null,null,null,null,"Sales Forecast","Rates","Revenue","Authorized Rates","Authorized Revenue","w/Pending Rates","w/Pending Revenue"]
[]
[null,null,null,"Baseline",187959.32956315737,2.5494747527979991,{"$f":"F7*E7","v":479197.56527410826},{"$f":"((Y10-I12-T12)/SUM(E7,F9/F7*E9,P7*((Q7/F7)),P9*((Q9/F7))))","v":2.2662488575326583},{"$f":"E7*H7","v":425962.61588510982},{"$f":"((Y13-K12-V12)/SUM(SUM(E7),F9/F7*SUM(E9),SUM(P7)*((Q7/F7)),SUM(P9)*(Q9/F7)))","v":2.4162389233952997},{"$f":"E7*J7","v":454154.64810578566},null,null,null,{"$f":"D7","v":"Baseline"},34568.659520669324,2.0180706682237539,{"$f":"Q7*P7","v":69761.997818476579},{"$f":"H7*(1+(Q7/F7-1))","v":1.7938794417410793},{"$f":"P7*S7","v":62012.00764267573},{"$f":"J7*(1+(Q7/F7-1))","v":1.9126060743975306},{"$f":"P7*U7","v":66116.228183012179},null,"Bundled Residential Rev Req "]
[null,null,null,null,null,null,null,null,null,null,null,null,null,null,null,null,null,null,null,null,null,null,null,"Current",{"$f":"(SUM(G7:G9)+SUM(R7:R9))","v":805527.03390815726}]
{"$rows_left_out":90}
{"sheet":"Hypothetical Summary","index":6,"n_rows":87,"n_cols":16,"rows_kept":87,"cut":false,"hidden":false,"merged":[[39,12,39,13],[77,10,77,11],[77,12,77,13],[54,1,54,2],[55,1,55,2],[48,1,48,2],[46,1,46,2],[47,1,47,2],[63,1,63,7],[65,1,65,2],[66,1,66,2],[67,1,67,2],[39,10,39,11],[57,1,57,7],[59,1,59,2],[60,1,60,2],[61,1,61,2],[51,1,51,7],[53,1,53,2],[82,1,82,7],[84,1,84,2],[86,1,86,2],[70,1,70,7],[72,1,72,2],[74,1,74,2],[76,1,76,7],[78,1,78,2],[80,1,80,2],[36,1,36,2],[26,9,26,15],[27,9,27,10],[28,9,28,10],[29,9,29,10],[26,1,26,7],[27,1,27,2],[28,1,28,2],[29,1,29,2],[32,1,32,7],[34,1,34,2],[35,1,35,2],[38,1,38,7],[40,1,40,2],[41,1,41,2],[42,1,42,2],[44,1,44,7]]}
[null,"Inputs:",null,null,null,"Assumptions:"]
[null,null,null,null,null,"Current Effective Rates",null,{"$f":"SetUp!D4","v":"2026-01-01"}]
[null,null,"Baseline Region - (Residential bill)","SDG&E",null,"Sales Forecast",null,{"$f":"Summary!I3","v":2024}]
[null,null,null,null,null,"Residential bill calculated using ",null,{"$f":"Summary!I4","v":"Schedule GR, Basic, Bundled, Single Family"}]
[null,null,null,"Revenue Change ($000)",null,"Non-CARE bill impact calculated with average summer usage of ",null,null,null,{"$f":"IF($D$3=\"ALL\",SUMPRODUCT('Hypothetical Res Bill Impact'!Q22:Q25,'Hypothetical Res Bill Impact'!U22:U25),VLOOKUP($D$3,'Hypothetical Res Bill Impact'!$P$22:$T$25,2,FALSE))","v":15},"therms per month"]
[null,null,"Procurement",null,null,"Non-CARE bill impact calculated with average winter usage of ",null,null,null,{"$f":"IF($D$3=\"ALL\",SUMPRODUCT('Hypothetical Res Bill Impact'!R22:R25,'Hypothetical Res Bill Impact'!U22:U25),VLOOKUP(D$3,'Hypothetical Res Bill Impact'!$P$22:$T$25,3,FALSE))","v":29},"therms per month"]
[null,null,"Customer Costs",null,null,"CARE bill impact calculated with average summer usage of ",null,null,null,{"$f":"IF($D$3=\"ALL\",SUMPRODUCT('Hypothetical Res Bill Impact'!S22:S25,'Hypothetical Res Bill Impact'!V22:V25),VLOOKUP($D$3,'Hypothetical Res Bill Impact'!$P$22:$T$25,4,FALSE))","v":14.833333333333334},"therms per month"]
[null,null,"Medium Pressure Distribution",null,null,"CARE bill impact calculated with average winter usage of ",null,null,null,{"$f":"IF($D$3=\"ALL\",SUMPRODUCT('Hypothetical Res Bill Impact'!T22:T25,'Hypothetical Res Bill Impact'!V22:V25),VLOOKUP($D$3,'Hypothetical Res Bill Impact'!$P$22:$T$25,5,FALSE))","v":24.666666666666668},"therms per month"]
{"$rows_left_out":80}
{"sheet":"Hypothetical SAR and RAR","index":7,"n_rows":29,"n_cols":27,"rows_kept":29,"cut":false,"hidden":false,"merged":[[18,20,18,21],[19,20,19,21],[17,22,17,23],[18,22,18,23],[19,22,19,23],[16,20,16,21],[16,22,16,23],[15,20,15,21],[15,22,15,23],[17,20,17,21],[64,20,64,21],[71,20,71,21],[25,5,25,8],[25,15,25,19],[31,5,31,7],[36,20,36,21],[46,20,46,21],[52,20,52,21]]}
[]
[null,null,"Revenue Change ($000)"]
[null,{"$f":"RevRecoveryMechanisms","v":"Core Procurement"},{"$f":"'Hypothetical Summary'!D6","v":0},null,null,null,"Allocation"]
[null,"Allocated Base Margin",{"$f":"'Hypothetical Summary'!D7","v":0},null,null,null,{"$f":"TRANSPOSE(RevRecoveryMechanisms)","v":"Core Procurement"},"Allocated Base Margin","Distribution","All Residential","Local Transmission","Seasonal Storage","GHG End User","Public Purpose Programs","-","46% Res (LUAF, Other)","ECPT","EPAM","CFCA","Non-Residential"]
[null,"Distribution",{"$f":"'Hypothetical Summary'!D8","v":0},null,null,"Residential",{"$f":"'SAR and RAR'!G5","v":0.57246929564900972},{"$f":"'SAR and RAR'!H5","v":0.81652373633254627},{"$f":"'SAR and RAR'!I5","v":0.71351095116714947},{"$f":"'SAR and RAR'!J5","v":1},{"$f":"'SAR and RAR'!K5","v":0.51543343712031298},{"$f":"'SAR and RAR'!L5","v":0.74052031744563351},{"$f":"'SAR and RAR'!M5","v":0.49735087986604948},{"$f":"'SAR and RAR'!N5","v":0.45465574087968463},{"$f":"'SAR and RAR'!O5","v":0},{"$f":"'SAR and RAR'!P5","v":0.43914119669235535},{"$f":"'SAR and RAR'!Q5","v":0.33016648110968039},{"$f":"'SAR and RAR'!R5","v":0.81652373633254627},{"$f":"'SAR and RAR'!S5","v":0.60198759162917603},{"$f":"'SAR and RAR'!T5","v":0}]
[null,"All Residential",{"$f":"'Hypothetical Summary'!D9","v":0}]
[null,"Local Transmission",{"$f":"'Hypothetical Summary'!D10","v":0},null,null,null,"Revenue Change ($000) - System"]
[null,"Seasonal Storage",{"$f":"'Hypothetical Summary'!D11","v":0},null,null,"w/Proposed",{"$f":"TRANSPOSE(RevRecoveryMechanisms)","v":"Core Procurement"},"Allocated Base Margin","Distribution","All Residential","Local Transmission","Seasonal Storage","GHG End User","Public Purpose Programs","-","46% Res (LUAF, Other)","ECPT","EPAM","CFCA","Non-Residential"]
{"$rows_left_out":22}
{"sheet":"Hypothetical Res Bill Impact","index":8,"n_rows":97,"n_cols":25,"rows_kept":97,"cut":false,"hidden":false,"merged":[[28,20,28,21],[29,16,29,17],[29,18,29,19],[39,11,39,16],[79,11,79,16],[89,11,89,16],[90,2,90,3],[90,4,90,5],[90,6,90,7],[90,8,90,9],[89,2,89,7],[80,2,80,3],[80,4,80,5],[80,6,80,7],[80,8,80,9],[79,2,79,7],[70,8,70,9],[69,2,69,7],[20,16,20,17],[20,18,20,19],[1,1,1,3],[50,4,50,5],[50,6,50,7],[70,2,70,3],[70,4,70,5],[70,6,70,7],[49,11,49,16],[59,11,59,16],[69,11,69,16],[39,1,39,8],[19,20,19,21],[2,4,2,8],[2,15,2,19],[50,8,50,9],[60,8,60,9],[49,2,49,7],[59,2,59,7],[40,2,40,3],[40,4,40,5],[40,6,40,7],[40,8,40,9],[38,1,38,7],[60,2,60,3],[60,4,60,5],[60,6,60,7],[50,2,50,3]]}
[]
[]
[null,null,null,null,"Schedule GR",null,null,null,null,null,null,null,null,null,null,"Schedule GR [CARE]"]
[null,null,null,null,{"$f":"SalesForecastYear","v":2024},{"$f":"'Res Bill Impact'!F4","v":"2026-01-01"},{"$f":"'Res Bill Impact'!G4","v":"2026-01-01"},"Proposed","Proposed",null,null,null,null,null,null,{"$f":"SalesForecastYear","v":2024},{"$f":"'Res Bill Impact'!Q4","v":"2026-01-01"},{"$f":"'Res Bill Impact'!R4","v":"2026-01-01"},"Proposed","Proposed"]
[null,null,null,null,"Sales Forecast","Rates","Revenue","Rates","Revenue",null,null,null,null,null,null,"Sales Forecast","Rates","Revenue","Rates","Revenue"]
[]
[null,null,null,"Baseline",{"$f":"'Res Bill Impact'!E7","v":187959.32956315737},{"$f":"'Res Bill Impact'!F7","v":2.5494747527979991},{"$f":"F7*E7","v":479197.56527410826},{"$f":"(Y10/SUM(SUM(E7),F9/F7*SUM(E9),SUM(P7)*(Q7/F7),SUM(P9)*(Q9/F7)))","v":2.5494747527979986},{"$f":"E7*H7","v":479197.5652741082},null,null,null,null,null,"Baseline ",{"$f":"'Res Bill Impact'!P7","v":34568.659520669324},{"$f":"'Res Bill Impact'!Q7","v":2.0180706682237539},{"$f":"'Res Bill Impact'!R7","v":69761.997818476579},{"$f":"H7*(1+(Q7/F7-1))","v":2.0180706682237535},{"$f":"P7*S7","v":69761.997818476564},null,null,null,"Bundled Residential Rev Req "]
[null,null,null,null,null,null,null,null,null,null,null,null,null,null,null,null,null,null,null,null,null,null,null,"Current",{"$f":"(SUM(G7:G12)+SUM(R7:R12))","v":805527.03390815726}]
{"$rows_left_out":90}
{"sheet":"SetUp","index":9,"n_rows":31,"n_cols":12,"rows_kept":31,"cut":false,"hidden":false,"merged":[]}
[]
[]
[]
[null,null,"Current Quarter Effective Rate Date","2026-01-01",null,"Zones",null,"Revenue Recovery Mechanisms",null,"Years Available for Rate Impact","Procurement Rate Assumption"]
[null,null,"Beginning of Year Effecive Rate Date","2026-01-01",null,"SDG&E",null,"Core Procurement",null,2026,0.39836499999999991]
[null,null,"Care Discount %",0.2,null,null,null,"Allocated Base Margin",null,{"$f":"J5+1","v":2027},{"$f":"K5*(1+L6)","v":0.43820149999999997},0.1]
[null,null,"Proposed Residential Fixed Charge",0,null,null,null,"Distribution",null,{"$f":"J6+1","v":2028},0.48202165000000002,0.1]
[null,null,null,null,null,null,null,"All Residential",null,2029,0.53022381500000004,0.1]
{"$rows_left_out":24}
{"sheet":"Selected Data","index":10,"n_rows":36,"n_cols":20,"rows_kept":36,"cut":false,"hidden":false,"merged":[]}
["SDGE Revenue Requirement List"]
[{"$f":"'Authorized Rev Req'!A2","v":"Annual Period 2025"}]
[{"$f":"'Authorized Rev Req'!A3","v":"Reporting Date: Quarter Ended March 31"}]
["Summary of Selected Data",null,null,null,null,null,null,null,null,null,null,null,null,null,null,null,"Revenue"]
[null,null,null,null,null,null,null,null,null,null,null,null,null,null,null,null," Requirement"]
[null,null,null,null,null,null,null,null,null,null,null,null,null,null,null,null,"$000"]
[1,"Current total system-level revenue requirement that is used for defining the reporting threshold:",null,null,null,null,null,null,null,null,null,null,null,null,null,null,{"$f":"'Authorized Rev Req'!O97","v":1012062.052750407}]
[null,"A","One-percent reporting threshold",null,null,null,null,null,null,null,null,null,null,null,null,null,{"$f":"Q7*0.01","v":10120.62052750407}]
{"$rows_left_out":28}