{"text_format":"1","workbook":"xlsx","n_sheets":11,"sheets":["Model Description","Summary","Authorized Rev Req","Incremental Rev Req","SAR and RAR","Res Bill Impact","SetUp","Selected Data","Hypothetical Summary","Hypothetical SAR and RAR","Hypothetical Res Bill Impact"],"not_rendered":{"charts":0,"images":0,"macros":1,"external_links":0,"defined_names":259,"comments":0,"pivot_tables":0},"unopened":[],"bounds":{"document_bytes":16777216,"sheet_cells":100000,"rows_first":2000,"rows_last":500,"rows_between":2000,"halvings":0,"cell_chars":16384,"cell_head_chars":4096},"cells_cut":0,"cells_raw":0,"read":"whole","date_system":"1900"}

{"sheet":"Model Description","index":0,"n_rows":14,"n_cols":2,"rows_kept":14,"cut":false,"hidden":false,"merged":[]}
[]
["Tab","Description"]
["Summary","This tab allows the user to input the year, baseline region, and other assumptions. Includes outputs of average bills for current and inputted year."]
[null,"Bundled represents customers that we procure gas for. System refers to all customer classes combined. Total System for a customer class includes Bundled + Unbundled. "]
["Authorized Rev Req","This tab shows the authorized revenue requirement for each line item that is in existing rates."]
["Incremental Rev Req","This tab contains several sections: (i) Approved Application(s), (ii) Pending Application(s) Not Yet Approved, and (iii) Applications Projected to be Filed. "]
[null,"The Approved Application(s) section shows the authorized revenue requirement for each line item forecasted out by year."]
[null,"The Pending Application(s) Not Yet Approved section includes pending advice letters or applications for new proceedings and any pending increases or decreases to current line items."]
{"$rows_left_out":7}
{"sheet":"Summary","index":1,"n_rows":83,"n_cols":19,"rows_kept":83,"cut":false,"hidden":false,"merged":[[82,10,82,11],[73,12,73,13],[73,14,73,15],[63,0,63,1],[42,10,42,11],[43,10,43,11],[44,10,44,11],[47,10,47,18],[51,0,51,1],[78,0,78,8],[76,0,76,1],[59,0,59,8],[61,0,61,1],[62,0,62,1],[53,0,53,8],[55,0,55,1],[35,12,35,13],[35,14,35,15],[47,0,47,8],[49,0,49,1],[50,0,50,1],[56,0,56,1],[57,0,57,1],[80,0,80,1],[82,0,82,1],[66,0,66,8],[68,0,68,1],[70,0,70,1],[72,0,72,8],[74,0,74,1],[32,0,32,1],[34,0,34,8],[36,0,36,1],[44,0,44,1],[37,0,37,1],[38,0,38,1],[40,0,40,8],[42,0,42,1],[43,0,43,1],[28,0,28,8],[30,0,30,1],[31,0,31,1],[28,10,28,18],[30,10,30,11],[31,10,31,11],[26,10,26,18],[23,0,23,1],[27,10,27,11],[24,0,24,1],[14,10,14,11],[23,10,23,11],[24,10,24,11],[22,10,22,18],[25,0,25,1],[25,10,25,11],[22,0,22,8]]}
["Inputs:",null,null,null,null,"Assumptions:"]
[null,{"$f":"CONCATENATE(\"Rate Impact for Year (\",SetUp!H5,\"-\",SetUp!H9,\")\")","v":"Rate Impact for Year (2026-2030)"},2026,null,null,"Current Effective Rates",null,{"$f":"CurrentEffectiveRateDate","v":"2026-01-01"}]
[null,"Baseline Region - (Residential bill)",1,null,null,"Sales Forecast",null,2024]
[null,null,null,null,null,"Residential bill calculated using ",null,"Schedule GR, Basic, Bundled, Single Family"]
[null,null,null,null,null,"Non-CARE bill impact calculated with average summer usage of ",null,null,null,{"$f":"IF($C$3=\"ALL\",SUMPRODUCT('Res Bill Impact'!Q22:Q25,'Res Bill Impact'!U22:U25),VLOOKUP($C$3,'Res Bill Impact'!$P$22:$T$25,2,FALSE))","v":21.826718254166668},"therms per month"]
["Pending Proceedings",null,"Include in Impact (Y)","Applicable Year(s)",null,"Non-CARE bill impact calculated with average winter usage of ",null,null,null,{"$f":"IF($C$3=\"ALL\",SUMPRODUCT('Res Bill Impact'!R22:R25,'Res Bill Impact'!U22:U25),VLOOKUP(C$3,'Res Bill Impact'!$P$22:$T$25,3,FALSE))","v":41.842517461666667},"therms per month"]
[{"$f":"'Incremental Rev Req'!A128","v":"DIMP Interim Recovery"},null,"Y",2026,null,"CARE bill impact calculated with average summer usage of ",null,null,null,{"$f":"IF($C$3=\"ALL\",SUMPRODUCT('Res Bill Impact'!S22:S25,'Res Bill Impact'!V22:V25),VLOOKUP($C$3,'Res Bill Impact'!$P$22:$T$25,4,FALSE))","v":18.417923196833332},"therms per month"]
[{"$f":"'Incremental Rev Req'!A129","v":"GRC PFM"},null,"Y",2026,null,"CARE bill impact calculated with average winter usage of ",null,null,null,{"$f":"IF($C$3=\"ALL\",SUMPRODUCT('Res Bill Impact'!T22:T25,'Res Bill Impact'!V22:V25),VLOOKUP($C$3,'Res Bill Impact'!$P$22:$T$25,5,FALSE))","v":32.877611860666669},"therms per month"]
{"$rows_left_out":76}
{"sheet":"Authorized Rev Req","index":2,"n_rows":135,"n_cols":18,"rows_kept":135,"cut":false,"hidden":false,"merged":[]}
[]
["Annual Period 2026"]
["Reporting Date: Quarter Ended March 31"]
[]
[null,"Revenue Requirement Date:","2022-01-01","2023-01-01","2023-03-01","2023-08-01","2023-11-01","2024-01-01","2024-07-01","2024-10-01","2025-01-01","2025-02-01","2025-07-01","2025-09-01","2025-10-01","2026-01-01"]
[null,"Advice Letter:","AL 5915-G","AL 6071-G","AL 6088-G","AL 6168-G","AL 6213-G","AL 6237-G","AL 6325-G","AL 6369-G","AL 6421-G","AL 6340-G-A","AL 6493-G","AL-6526","AL-6538","AL-6578"]
["Filing Description","Authority for Revenue Requirement as of 2/1/2025","Authorized Revenue Requirement       ($000) ","Authorized Revenue Requirement       ($000) ","Authorized Revenue Requirement       ($000) ","Authorized Revenue Requirement       ($000) ","Authorized Revenue Requirement       ($000) ","Authorized Revenue Requirement       ($000) ","Authorized Revenue Requirement       ($000) ","Authorized Revenue Requirement       ($000) ","Authorized Revenue Requirement       ($000) ","Authorized Revenue Requirement       ($000) ","Authorized Revenue Requirement       ($000) ","Authorized Revenue Requirement       ($000) ","Authorized Revenue Requirement       ($000) ","Authorized Revenue Requirement       ($000) ","Revenue Recovery Mechanism","Balancing Account "]
["Safety Affordability Reliability Proceedings"]
{"$rows_left_out":128}
{"sheet":"Incremental Rev Req","index":3,"n_rows":166,"n_cols":19,"rows_kept":166,"cut":false,"hidden":false,"merged":[]}
[]
[{"$f":"'Authorized Rev Req'!A2","v":"Annual Period 2026"}]
["Reporting Date: Quarter Ended March 31"]
[]
["Current Revenue Requirement ($000):",{"$f":"'Authorized Rev Req'!O135","v":6914149.915177322}]
["Current Revenue Requirement Effective:",{"$f":"'Authorized Rev Req'!P5","v":"2026-01-01"}]
["Approved Application(s), Implemented Since Jan 1 or To Be Implemented"]
["Filing Description","Proceeding","Authority for Revenue Requirement","Authorized Revenue Requirement with FF&U ($000)","Revenue Recovery Mechanism","Authorized Revenue Requirement with FF&U ($000) - Breakout by Year",null,null,null,null,"Existing or New Item (if existing, use delta from prior for rate impact)",null,null,null,{"$f":"TRANSPOSE(YearsForRateImpact)","v":2026},2027,2028,2029,2030]
{"$rows_left_out":159}
{"sheet":"SAR and RAR","index":4,"n_rows":34,"n_cols":29,"rows_kept":34,"cut":false,"hidden":false,"merged":[[15,23,16,23],[15,24,16,24],[16,19,16,20],[16,21,16,22],[31,4,31,6],[15,21,15,22],[17,19,17,20],[18,19,18,20],[19,19,19,20],[17,21,17,22],[18,21,18,22],[19,21,19,22],[46,19,46,20],[52,19,52,20],[0,1,0,2],[25,4,25,9],[71,19,71,20],[15,19,15,20],[25,14,25,20],[64,19,64,20],[36,19,36,20]]}
[null,"Revenue Change ($000)"]
[null,"Authorized","w/ Pending"]
[{"$f":"RevRecoveryMechanisms","v":"Core Procurement"},{"$f":"INDEX('Incremental Rev Req'!$N$9:$S$22,MATCH(A3,'Incremental Rev Req'!$N$9:$N$22,0),MATCH(Summary!$C$2,'Incremental Rev Req'!$N$8:$S$8,0))","v":1175646.3739297725},{"$f":"INDEX('Incremental Rev Req'!$N$132:$S$145,MATCH(A3,'Incremental Rev Req'!$N$132:$N$145,0),MATCH(Summary!$C$2,'Incremental Rev Req'!$N$131:$S$131,0))","v":1175646.3739297725},null,null,"Allocation",null,null,null,null,null,null,null,null,"Other Revenues and Balancing Accounts"]
["Allocated Base Margin",{"$f":"INDEX('Incremental Rev Req'!$N$9:$S$22,MATCH(A4,'Incremental Rev Req'!$N$9:$N$22,0),MATCH(Summary!$C$2,'Incremental Rev Req'!$N$8:$S$8,0))","v":3332575.2234169943},{"$f":"INDEX('Incremental Rev Req'!$N$132:$S$145,MATCH(A4,'Incremental Rev Req'!$N$132:$N$145,0),MATCH(Summary!$C$2,'Incremental Rev Req'!$N$131:$S$131,0))","v":3332575.2234169943},null,null,{"$f":"TRANSPOSE(RevRecoveryMechanisms)","v":"Core Procurement"},"Allocated Base Margin","Distribution","ECPT adjusted","Local Transmission","SGIP","GHG End User","Public Purpose Programs","Backbone Transmission","47% Res (LUAF, Other)","ECPT","EPAM","CFCA","Non-Residential","CPUC Fee"]
["Distribution",{"$f":"INDEX('Incremental Rev Req'!$N$9:$S$22,MATCH(A5,'Incremental Rev Req'!$N$9:$N$22,0),MATCH(Summary!$C$2,'Incremental Rev Req'!$N$8:$S$8,0))","v":162866.79984288869},{"$f":"INDEX('Incremental Rev Req'!$N$132:$S$145,MATCH(A5,'Incremental Rev Req'!$N$132:$N$145,0),MATCH(Summary!$C$2,'Incremental Rev Req'!$N$131:$S$131,0))","v":162866.79984288869},null,"Residential",0.66601721869093866,0.7088390310425271,0.60958719745279855,0.40124317553935529,0.42070172248855825,0.37075853546526083,0.54372557546636102,0.55264321661263083,0,0.47353824248925735,0.25833090482822446,0.7088390310425271,0.7082921541939623,0,{"$f":"RegulatoryFee","v":3.5000000000000001E-3}]
["ECPT adjusted",{"$f":"INDEX('Incremental Rev Req'!$N$9:$S$22,MATCH(A6,'Incremental Rev Req'!$N$9:$N$22,0),MATCH(Summary!$C$2,'Incremental Rev Req'!$N$8:$S$8,0))","v":13143.049263521323},{"$f":"INDEX('Incremental Rev Req'!$N$132:$S$145,MATCH(A6,'Incremental Rev Req'!$N$132:$N$145,0),MATCH(Summary!$C$2,'Incremental Rev Req'!$N$131:$S$131,0))","v":13143.049263521323}]
["Local Transmission",{"$f":"INDEX('Incremental Rev Req'!$N$9:$S$22,MATCH(A7,'Incremental Rev Req'!$N$9:$N$22,0),MATCH(Summary!$C$2,'Incremental Rev Req'!$N$8:$S$8,0))","v":21550.009827655304},{"$f":"INDEX('Incremental Rev Req'!$N$132:$S$145,MATCH(A7,'Incremental Rev Req'!$N$132:$N$145,0),MATCH(Summary!$C$2,'Incremental Rev Req'!$N$131:$S$131,0))","v":21550.009827655304},null,null,"Revenue Change ($000) - System"]
["SGIP",{"$f":"INDEX('Incremental Rev Req'!$N$9:$S$22,MATCH(A8,'Incremental Rev Req'!$N$9:$N$22,0),MATCH(Summary!$C$2,'Incremental Rev Req'!$N$8:$S$8,0))","v":0},{"$f":"INDEX('Incremental Rev Req'!$N$132:$S$145,MATCH(A8,'Incremental Rev Req'!$N$132:$N$145,0),MATCH(Summary!$C$2,'Incremental Rev Req'!$N$131:$S$131,0))","v":0},null,"Authorized",{"$f":"TRANSPOSE(RevRecoveryMechanisms)","v":"Core Procurement"},"Allocated Base Margin","Distribution","ECPT adjusted","Local Transmission","SGIP","GHG End User","Public Purpose Programs","Backbone Transmission","47% Res (LUAF, Other)","ECPT","EPAM","CFCA","Non-Residential"]
{"$rows_left_out":27}
{"sheet":"Res Bill Impact","index":5,"n_rows":97,"n_cols":25,"rows_kept":97,"cut":false,"hidden":false,"merged":[[49,2,49,9],[39,2,39,9],[40,2,40,3],[40,4,40,5],[40,6,40,7],[40,8,40,9],[1,1,1,3],[2,4,2,10],[2,15,2,21],[38,2,38,9],[60,2,60,3],[60,4,60,5],[60,6,60,7],[60,8,60,9],[19,20,19,21],[20,16,20,17],[20,18,20,19],[50,2,50,3],[50,4,50,5],[50,6,50,7],[50,8,50,9],[59,2,59,9],[69,2,69,9],[70,2,70,3],[70,4,70,5],[70,6,70,7],[70,8,70,9],[79,2,79,9],[80,2,80,3],[80,4,80,5],[80,6,80,7],[80,8,80,9],[89,2,89,9],[90,2,90,3],[90,4,90,5],[90,6,90,7],[90,8,90,9],[38,13,38,20],[39,13,39,20],[40,13,40,14],[40,15,40,16],[40,17,40,18],[40,19,40,20],[49,13,49,20],[50,13,50,14],[50,15,50,16],[50,17,50,18],[50,19,50,20],[70,17,70,18],[70,19,70,20],[59,13,59,20],[60,13,60,14],[60,15,60,16],[60,17,60,18],[60,19,60,20],[28,20,28,21],[29,16,29,17],[29,18,29,19],[89,13,89,20],[90,13,90,14],[90,15,90,16],[90,17,90,18],[90,19,90,20],[79,13,79,20],[80,13,80,14],[80,15,80,16],[80,17,80,18],[80,19,80,20],[69,13,69,20],[70,13,70,14],[70,15,70,16]]}
[]
[]
[null,null,null,null,"Schedule GR",null,null,null,null,null,null,null,null,null,null,"Schedule GR [CARE]"]
[null,null,null,null,{"$f":"SalesForecastYear","v":2024},{"$f":"CurrentEffectiveRateDate","v":"2026-01-01"},{"$f":"CurrentEffectiveRateDate","v":"2026-01-01"},"Proposed","Proposed","Proposed","Proposed",null,null,null,null,{"$f":"SalesForecastYear","v":2024},{"$f":"CurrentEffectiveRateDate","v":"2026-01-01"},{"$f":"CurrentEffectiveRateDate","v":"2026-01-01"},"Proposed","Proposed","Proposed","Proposed"]
[null,null,null,null,"System Sales Forecast","Rates","Revenue","Authorized Rates","Authorized Revenue","w/Pending Rates","w/Pending Revenue",null,null,null,null,"Sales Forecast","Rates","Revenue","Authorized Rates","Authorized Revenue","w/Pending Rates","w/Pending Revenue"]
[]
[null,null,null,"Baseline",1106153.3069462192,1.6405591456691377,{"$f":"F7*E7","v":1814709.9242227809},{"$f":"((Y10-I12-T12)/SUM(E7,F9/F7*E9,P7*((Q7/F7)),P9*((Q9/F7))))","v":1.7052537249534983},{"$f":"E7*H7","v":1886272.0470396706},{"$f":"((Y13-K12-V12)/SUM(SUM(E7),F9/F7*SUM(E9),SUM(P7)*((Q7/F7)),SUM(P9)*(Q9/F7)))","v":1.7823586917818017},{"$f":"E7*J7","v":1971561.961078777},null,null,null,{"$f":"D7","v":"Baseline"},408227.7801997147,1.2846688846065153,{"$f":"Q7*P7","v":524437.52705456119},{"$f":"H7*(1+(Q7/F7-1))","v":1.335329120312573},{"$f":"P7*S7","v":545118.44262123946},{"$f":"J7*(1+(Q7/F7-1))","v":1.3957075297069734},{"$f":"P7*U7","v":569766.58666030515},null,"Bundled Residential Rev Req "]
[null,null,null,null,null,null,null,null,null,null,null,null,null,null,null,null,null,null,null,null,null,null,null,"Current",{"$f":"(SUM(G7:G9)+SUM(R7:R9))","v":3689132.6088702651}]
{"$rows_left_out":90}
{"sheet":"SetUp","index":6,"n_rows":32,"n_cols":10,"rows_kept":32,"cut":false,"hidden":false,"merged":[]}
[]
[]
[]
["Current Quarter Effective Rate Date","2026-01-01",null,"Zones",null,"Revenue Recovery Mechanisms",null,"Years Available for Rate Impact","Procurement Rate Assumption"]
["Beginning of Year Effecive Rate Date","2026-01-01",null,1,null,"Core Procurement",null,2026,0.38766616792666664]
["Care Discount %",0.2,null,2,null,"Allocated Base Margin",null,{"$f":"H5+1","v":2027},{"$f":"I5*(1+J6)","v":0.42643278471933332},0.1]
["Proposed Residential Fixed Charge",5,null,3,null,"Distribution",null,{"$f":"H6+1","v":2028},{"$f":"I6*(1+J7)","v":0.46907606319126671},0.1]
[null,null,null,null,null,"ECPT adjusted",null,2029,0.51598366951039343,0.1]
{"$rows_left_out":25}
{"sheet":"Selected Data","index":7,"n_rows":46,"n_cols":20,"rows_kept":46,"cut":false,"hidden":false,"merged":[[18,1,18,14],[26,1,26,14]]}
[{"$f":"'Authorized Rev Req'!A1","v":0}]
[{"$f":"'Authorized Rev Req'!A2","v":"Annual Period 2026"}]
[{"$f":"'Authorized Rev Req'!A3","v":"Reporting Date: Quarter Ended March 31"}]
["Summary of Selected Data "]
[null,null,null,null,null,null,null,null,null,null,null,null,null,null,null,null,"Revenue"]
[null,null,null,null,null,null,null,null,null,null,null,null,null,null,null,null," Requirement"]
[null,null,null,null,null,null,null,null,null,null,null,null,null,null,null,null,"$000"]
[1,"Current total system-level revenue requirement that is used for defining the reporting threshold:",null,null,null,null,null,null,null,null,null,null,null,null,null,null,{"$f":"'Incremental Rev Req'!B5","v":6914149.915177322}]
{"$rows_left_out":39}
{"sheet":"Hypothetical Summary","index":8,"n_rows":87,"n_cols":16,"rows_kept":87,"cut":false,"hidden":false,"merged":[[77,10,77,11],[77,12,77,13],[29,9,29,10],[27,9,27,10],[28,9,28,10],[26,9,26,15],[39,10,39,11],[39,12,39,13],[51,1,51,7],[53,1,53,2],[26,1,26,7],[27,1,27,2],[28,1,28,2],[29,1,29,2],[32,1,32,7],[47,1,47,2],[48,1,48,2],[38,1,38,7],[40,1,40,2],[41,1,41,2],[42,1,42,2],[54,1,54,2],[55,1,55,2],[63,1,63,7],[65,1,65,2],[66,1,66,2],[67,1,67,2],[57,1,57,7],[59,1,59,2],[60,1,60,2],[61,1,61,2],[82,1,82,7],[84,1,84,2],[86,1,86,2],[70,1,70,7],[72,1,72,2],[74,1,74,2],[76,1,76,7],[78,1,78,2],[80,1,80,2],[44,1,44,7],[46,1,46,2],[36,1,36,2],[34,1,34,2],[35,1,35,2]]}
[null,"Inputs:",null,null,null,"Assumptions:"]
[null,null,null,null,null,"Current Effective Rates",null,{"$f":"SetUp!B4","v":"2026-01-01"}]
[null,null,"Baseline Region - (Residential bill)","All",null,"Sales Forecast",null,{"$f":"Summary!H3","v":2024}]
[null,null,null,null,null,"Residential bill calculated using ",null,{"$f":"Summary!H4","v":"Schedule GR, Basic, Bundled, Single Family"}]
[null,null,null,"Revenue Change ($000)",null,"Non-CARE bill impact calculated with average summer usage of ",null,null,null,{"$f":"IF($D$3=\"ALL\",SUMPRODUCT('Hypothetical Res Bill Impact'!Q22:Q25,'Hypothetical Res Bill Impact'!U22:U25),VLOOKUP($D$3,'Hypothetical Res Bill Impact'!$P$22:$T$25,2,FALSE))","v":19.856823684160645},"therms per month"]
[null,null,"Procurement",null,null,"Non-CARE bill impact calculated with average winter usage of ",null,null,null,{"$f":"IF($D$3=\"ALL\",SUMPRODUCT('Hypothetical Res Bill Impact'!R22:R25,'Hypothetical Res Bill Impact'!U22:U25),VLOOKUP(D$3,'Hypothetical Res Bill Impact'!$P$22:$T$25,3,FALSE))","v":50.9652436447832},"therms per month"]
[null,null,"Customer Costs",null,null,"CARE bill impact calculated with average summer usage of ",null,null,null,{"$f":"IF($D$3=\"ALL\",SUMPRODUCT('Hypothetical Res Bill Impact'!S22:S25,'Hypothetical Res Bill Impact'!V22:V25),VLOOKUP($D$3,'Hypothetical Res Bill Impact'!$P$22:$T$25,4,FALSE))","v":21.854295062073248},"therms per month"]
[null,null,"Medium Pressure Distribution",null,null,"CARE bill impact calculated with average winter usage of ",null,null,null,{"$f":"IF($D$3=\"ALL\",SUMPRODUCT('Hypothetical Res Bill Impact'!T22:T25,'Hypothetical Res Bill Impact'!V22:V25),VLOOKUP($D$3,'Hypothetical Res Bill Impact'!$P$22:$T$25,5,FALSE))","v":55.434791033648885},"therms per month"]
{"$rows_left_out":80}
{"sheet":"Hypothetical SAR and RAR","index":9,"n_rows":29,"n_cols":26,"rows_kept":29,"cut":false,"hidden":false,"merged":[[18,19,18,20],[19,19,19,20],[18,21,18,22],[17,21,17,22],[19,21,19,22],[16,19,16,20],[16,21,16,22],[15,19,15,20],[15,21,15,22],[17,19,17,20],[64,19,64,20],[71,19,71,20],[25,4,25,7],[25,14,25,18],[31,4,31,6],[36,19,36,20],[46,19,46,20],[52,19,52,20]]}
[]
[null,"Revenue Change ($000)"]
[{"$f":"RevRecoveryMechanisms","v":"Core Procurement"},{"$f":"'Hypothetical Summary'!D6","v":0},null,null,null,"Allocation"]
["Allocated Base Margin",{"$f":"'Hypothetical Summary'!D7","v":0},null,null,null,{"$f":"TRANSPOSE(RevRecoveryMechanisms)","v":"Core Procurement"},"Allocated Base Margin","Distribution","ECPT adjusted","Local Transmission","SGIP","GHG End User","Public Purpose Programs","Backbone Transmission","47% Res (LUAF, Other)","ECPT","EPAM","CFCA","Non-Residential"]
["Distribution",{"$f":"'Hypothetical Summary'!D8","v":0},null,null,"Residential",{"$f":"'SAR and RAR'!F5","v":0.66601721869093866},{"$f":"'SAR and RAR'!G5","v":0.7088390310425271},{"$f":"'SAR and RAR'!H5","v":0.60958719745279855},{"$f":"'SAR and RAR'!I5","v":0.40124317553935529},{"$f":"'SAR and RAR'!J5","v":0.42070172248855825},{"$f":"'SAR and RAR'!K5","v":0.37075853546526083},{"$f":"'SAR and RAR'!L5","v":0.54372557546636102},{"$f":"'SAR and RAR'!M5","v":0.55264321661263083},{"$f":"'SAR and RAR'!N5","v":0},{"$f":"'SAR and RAR'!O5","v":0.47353824248925735},{"$f":"'SAR and RAR'!P5","v":0.25833090482822446},{"$f":"'SAR and RAR'!Q5","v":0.7088390310425271},{"$f":"'SAR and RAR'!R5","v":0.7082921541939623},{"$f":"'SAR and RAR'!S5","v":0}]
["ECPT adjusted",{"$f":"'Hypothetical Summary'!D9","v":0}]
["Local Transmission",{"$f":"'Hypothetical Summary'!D10","v":0},null,null,null,"Revenue Change ($000) - System"]
["SGIP",{"$f":"'Hypothetical Summary'!D11","v":0},null,null,"w/Proposed",{"$f":"TRANSPOSE(RevRecoveryMechanisms)","v":"Core Procurement"},"Allocated Base Margin","Distribution","ECPT adjusted","Local Transmission","SGIP","GHG End User","Public Purpose Programs","Backbone Transmission","47% Res (LUAF, Other)","ECPT","EPAM","CFCA","Non-Residential"]
{"$rows_left_out":22}
{"sheet":"Hypothetical Res Bill Impact","index":10,"n_rows":97,"n_cols":25,"rows_kept":97,"cut":false,"hidden":false,"merged":[[28,20,28,21],[29,16,29,17],[29,18,29,19],[39,11,39,16],[79,11,79,16],[89,11,89,16],[90,2,90,3],[90,4,90,5],[90,6,90,7],[90,8,90,9],[89,2,89,7],[80,2,80,3],[80,4,80,5],[80,6,80,7],[80,8,80,9],[79,2,79,7],[70,8,70,9],[69,2,69,7],[20,16,20,17],[20,18,20,19],[1,1,1,3],[50,4,50,5],[50,6,50,7],[39,2,39,7],[70,2,70,3],[70,4,70,5],[70,6,70,7],[49,11,49,16],[59,11,59,16],[69,11,69,16],[19,20,19,21],[2,4,2,8],[2,15,2,19],[50,8,50,9],[60,8,60,9],[49,2,49,7],[59,2,59,7],[40,2,40,3],[40,4,40,5],[40,6,40,7],[40,8,40,9],[38,1,38,7],[60,2,60,3],[60,4,60,5],[60,6,60,7],[50,2,50,3]]}
[]
[]
[null,null,null,null,"Schedule GR",null,null,null,null,null,null,null,null,null,null,"Schedule GR [CARE]"]
[null,null,null,null,{"$f":"'Res Bill Impact'!E4","v":2024},{"$f":"'Res Bill Impact'!F4","v":"2026-01-01"},{"$f":"'Res Bill Impact'!G4","v":"2026-01-01"},"Proposed","Proposed",null,null,null,null,null,null,{"$f":"SalesForecastYear","v":2024},{"$f":"'Res Bill Impact'!Q4","v":"2026-01-01"},{"$f":"'Res Bill Impact'!R4","v":"2026-01-01"},"Proposed","Proposed"]
[null,null,null,null,"Sales Forecast","Rates","Revenue","Rates","Revenue",null,null,null,null,null,null,"Sales Forecast","Rates","Revenue","Rates","Revenue"]
[]
[null,null,null,"Baseline",{"$f":"'Res Bill Impact'!E7","v":1106153.3069462192},{"$f":"'Res Bill Impact'!F7","v":1.6405591456691377},{"$f":"F7*E7","v":1814709.9242227809},{"$f":"(Y10/SUM(SUM(E7),F9/F7*SUM(E9),SUM(P7)*(1+(Q7/F7-1)),SUM(P9)*(1+(Q9/F9-1))*F9/F7))","v":1.640559145669138},{"$f":"E7*H7","v":1814709.9242227811},null,null,null,null,null,"Baseline ",{"$f":"'Res Bill Impact'!P7","v":408227.7801997147},{"$f":"'Res Bill Impact'!Q7","v":1.2846688846065153},{"$f":"'Res Bill Impact'!R7","v":524437.52705456119},{"$f":"H7*(1+(Q7/F7-1))","v":1.2846688846065153},{"$f":"P7*S7","v":524437.52705456119},null,null,null,"Bundled Residential Rev Req "]
[null,null,null,null,null,null,null,null,null,null,null,null,null,null,null,null,null,null,null,null,null,null,null,"Current",{"$f":"(SUM(G7:G9)+SUM(R7:R9))","v":3689132.6088702651}]
{"$rows_left_out":89}