{"text_format":"1","workbook":"xlsx","n_sheets":11,"sheets":["README","ReleaseNotes","unique_contracts","accepted_data_types","resources","lse_names","misc","CPSReportSheet (2)","Reliability","CSPReportSheet","ReportSheet"],"not_rendered":{"charts":2,"images":0,"macros":1,"external_links":1,"defined_names":55,"comments":0,"pivot_tables":0},"unopened":[],"bounds":{"document_bytes":16777216,"sheet_cells":100000,"rows_first":2000,"rows_last":500,"rows_between":2000,"halvings":0,"cell_chars":16384,"cell_head_chars":4096},"cells_cut":0,"cells_raw":0,"read":"whole","date_system":"1900"}

{"sheet":"README","index":0,"n_rows":4,"n_cols":4,"rows_kept":4,"cut":false,"hidden":false,"merged":[[3,0,3,1],[3,3,4,6]]}
["ReleaseVersion","rdtv3"]
["ReleaseDate","2022-06-06"]
[]
[null,null,null," In order to run the macro, LSEs must FIRST enable macros. Then, they are instructed to complete the RDT data entry fully, then push the button on the README tab. "]

{"sheet":"ReleaseNotes","index":1,"n_rows":1,"n_cols":4,"rows_kept":1,"cut":false,"hidden":false,"merged":[]}
["ReleaseVersion","ReleaseDate","ID","Note"]

{"sheet":"unique_contracts","index":2,"n_rows":2,"n_cols":100,"rows_kept":2,"cut":false,"hidden":false,"merged":[]}
["lse_unique_contract_id","resource","alternative_resource_name","contract_status","caiso_queue_position","interconnection_substation ","marginal_addition","marginal_addition_to","total_nameplate_capacity","contracted_nameplate_capacity","sep_contracted_mw_nqc","contract_gwh_annual","is_hybrid_paired","can_charge_from_grid","total_generator_mw","contracted_generator_mw","total_storage_mw","contracted_storage_mw","solar_storage_technology_sub_type","storage_technology_sub_type","total_storage_depth_mwh","contracted_storage_depth_mwh","viability_cod_reasonableness","viability_technical_feasibility","viability_financing_sitecontrol","resource_mix","cam_d19_vamo_pcia","buy_or_sell","counterparty","generator_supplier","developer_name","capacity_area","capacity_sub_area","cpuc_approval_ref","county","COD_year","COD_month","COD_day","contract_start_date_year","contract_start_date_month","contract_start_date_day","contract_end_date_year","contract_end_date_month","contract_end_date_day","contract_execution_date_year","contract_execution_date_month","contract_execution_date_day","tx_upgrades","tx_upgrade_date_year","tx_upgrade_date_month","tx_upgrade_date_day","d1911016_tranche","d2106035_tranche","mtr_tranche1_NQC","mtr_tranche2_NQC ","mtr_tranche3_NQC","mtr_tranche4_NQC ","previous_COD_year","previous_COD_month","previous_COD_day","remediation_plan","signed_contract","notice_to_proceed","public_contract","buying_energy_capacity","NQC_reporting_source","procurement_origin","csp_resource_category","csp_annual_2024","csp_annual_2026","csp_annual_2030","csp_annual_2035","macro_supertype","notes",null,"Reliability Calculation>>\nPlease extend the formulas in columns BY:CE, CH:CV to all rows with contract information entered on the left ","multiplier","resource elcc type","hybrid storage elcc type","elcc type (for summary tables and charts)","start year","end year","hybrid derate",null,"ELCC (MW)",2021,2022,2023,2024,2025,2026,2027,2028,2029,2030,2031,2032,2033,2034,2035]
[null,null,null,null,null,null,null,null,null,null,null,null,null,null,null,null,null,null,null,null,null,null,null,null,null,null,null,null,null,null,null,null,null,null,null,null,null,null,null,null,null,null,null,null,null,null,null,null,null,null,null,null,null,null,null,null,null,null,null,null,null,null,null,null,null,null,null,null,null,null,null,null,null,null,null,null,{"$f":"IF(AND(AB2=\"Sell\",ISNUMBER(SEARCH(\"Capacity\",BM2))),-1,IF(AND(NOT(AB2=\"Sell\"),ISNUMBER(SEARCH(\"Capacity\",BM2))),1,0))","v":0},{"$f":"IFERROR(IF(AND(V2>0,OR(M2=\"\",M2=\"NotHybrid\")),_xlfn.CONCAT(V2/J2,INDEX(resources!$G:$G,MATCH(B2,resources!$A:$A,0))),INDEX(resources!$G:$G,MATCH(B2,resources!$A:$A,0))),\"n/a\")","v":"n/a"},{"$f":"IFERROR(IF(NOT(OR(M2=\"\",M2=\"NotHybrid\")),_xlfn.CONCAT(V2/R2,\"hr_batteries\"),\"n/a\"),\"n/a\")","v":"n/a"},{"$f":"IF(CA2=\"n/a\",BZ2,\"hybrid\")","v":"n/a"},{"$f":"IFERROR(IF(DATE(AM2,AN2,AO2)<=DATE(AM2,6,1),AM2,AM2+1),0)","v":0},{"$f":"IFERROR(IF(DATE(AP2,AQ2,AR2)>=DATE(AP2,10,1),AP2,AP2-1),0)","v":0},1,null,null,{"$f":"MIN((IFERROR(IF(AND($CC2<=CH$1,$CD2>=CH$1),INDEX(Reliability!E$19:E$40,MATCH($BZ2,Reliability!$C$19:$C$40,0)),0),0)*IF($CA2=\"n/a\",$J2,$P2)+IFERROR(IF(AND($CC2<=CH$1,$CD2>=CH$1),INDEX(Reliability!E$19:E$40,MATCH($CA2,Reliability!$C$19:$C$40,0)),0),0)*$R2)*$CE2,$J2)*$BY2","v":0},{"$f":"MIN((IFERROR(IF(AND($CC2<=CI$1,$CD2>=CI$1),INDEX(Reliability!F$19:F$40,MATCH($BZ2,Reliability!$C$19:$C$40,0)),0),0)*IF($CA2=\"n/a\",$J2,$P2)+IFERROR(IF(AND($CC2<=CI$1,$CD2>=CI$1),INDEX(Reliability!F$19:F$40,MATCH($CA2,Reliability!$C$19:$C$40,0)),0),0)*$R2)*$CE2,$J2)*$BY2","v":0},{"$f":"MIN((IFERROR(IF(AND($CC2<=CJ$1,$CD2>=CJ$1),INDEX(Reliability!G$19:G$40,MATCH($BZ2,Reliability!$C$19:$C$40,0)),0),0)*IF($CA2=\"n/a\",$J2,$P2)+IFERROR(IF(AND($CC2<=CJ$1,$CD2>=CJ$1),INDEX(Reliability!G$19:G$40,MATCH($CA2,Reliability!$C$19:$C$40,0)),0),0)*$R2)*$CE2,$J2)*$BY2","v":0},{"$f":"MIN((IFERROR(IF(AND($CC2<=CK$1,$CD2>=CK$1),INDEX(Reliability!H$19:H$40,MATCH($BZ2,Reliability!$C$19:$C$40,0)),0),0)*IF($CA2=\"n/a\",$J2,$P2)+IFERROR(IF(AND($CC2<=CK$1,$CD2>=CK$1),INDEX(Reliability!H$19:H$40,MATCH($CA2,Reliability!$C$19:$C$40,0)),0),0)*$R2)*$CE2,$J2)*$BY2","v":0},{"$f":"MIN((IFERROR(IF(AND($CC2<=CL$1,$CD2>=CL$1),INDEX(Reliability!I$19:I$40,MATCH($BZ2,Reliability!$C$19:$C$40,0)),0),0)*IF($CA2=\"n/a\",$J2,$P2)+IFERROR(IF(AND($CC2<=CL$1,$CD2>=CL$1),INDEX(Reliability!I$19:I$40,MATCH($CA2,Reliability!$C$19:$C$40,0)),0),0)*$R2)*$CE2,$J2)*$BY2","v":0},{"$f":"MIN((IFERROR(IF(AND($CC2<=CM$1,$CD2>=CM$1),INDEX(Reliability!J$19:J$40,MATCH($BZ2,Reliability!$C$19:$C$40,0)),0),0)*IF($CA2=\"n/a\",$J2,$P2)+IFERROR(IF(AND($CC2<=CM$1,$CD2>=CM$1),INDEX(Reliability!J$19:J$40,MATCH($CA2,Reliability!$C$19:$C$40,0)),0),0)*$R2)*$CE2,$J2)*$BY2","v":0},{"$f":"MIN((IFERROR(IF(AND($CC2<=CN$1,$CD2>=CN$1),INDEX(Reliability!K$19:K$40,MATCH($BZ2,Reliability!$C$19:$C$40,0)),0),0)*IF($CA2=\"n/a\",$J2,$P2)+IFERROR(IF(AND($CC2<=CN$1,$CD2>=CN$1),INDEX(Reliability!K$19:K$40,MATCH($CA2,Reliability!$C$19:$C$40,0)),0),0)*$R2)*$CE2,$J2)*$BY2","v":0},{"$f":"MIN((IFERROR(IF(AND($CC2<=CO$1,$CD2>=CO$1),INDEX(Reliability!L$19:L$40,MATCH($BZ2,Reliability!$C$19:$C$40,0)),0),0)*IF($CA2=\"n/a\",$J2,$P2)+IFERROR(IF(AND($CC2<=CO$1,$CD2>=CO$1),INDEX(Reliability!L$19:L$40,MATCH($CA2,Reliability!$C$19:$C$40,0)),0),0)*$R2)*$CE2,$J2)*$BY2","v":0},{"$f":"MIN((IFERROR(IF(AND($CC2<=CP$1,$CD2>=CP$1),INDEX(Reliability!M$19:M$40,MATCH($BZ2,Reliability!$C$19:$C$40,0)),0),0)*IF($CA2=\"n/a\",$J2,$P2)+IFERROR(IF(AND($CC2<=CP$1,$CD2>=CP$1),INDEX(Reliability!M$19:M$40,MATCH($CA2,Reliability!$C$19:$C$40,0)),0),0)*$R2)*$CE2,$J2)*$BY2","v":0},{"$f":"MIN((IFERROR(IF(AND($CC2<=CQ$1,$CD2>=CQ$1),INDEX(Reliability!N$19:N$40,MATCH($BZ2,Reliability!$C$19:$C$40,0)),0),0)*IF($CA2=\"n/a\",$J2,$P2)+IFERROR(IF(AND($CC2<=CQ$1,$CD2>=CQ$1),INDEX(Reliability!N$19:N$40,MATCH($CA2,Reliability!$C$19:$C$40,0)),0),0)*$R2)*$CE2,$J2)*$BY2","v":0},{"$f":"MIN((IFERROR(IF(AND($CC2<=CR$1,$CD2>=CR$1),INDEX(Reliability!O$19:O$40,MATCH($BZ2,Reliability!$C$19:$C$40,0)),0),0)*IF($CA2=\"n/a\",$J2,$P2)+IFERROR(IF(AND($CC2<=CR$1,$CD2>=CR$1),INDEX(Reliability!O$19:O$40,MATCH($CA2,Reliability!$C$19:$C$40,0)),0),0)*$R2)*$CE2,$J2)*$BY2","v":0},{"$f":"MIN((IFERROR(IF(AND($CC2<=CS$1,$CD2>=CS$1),INDEX(Reliability!P$19:P$40,MATCH($BZ2,Reliability!$C$19:$C$40,0)),0),0)*IF($CA2=\"n/a\",$J2,$P2)+IFERROR(IF(AND($CC2<=CS$1,$CD2>=CS$1),INDEX(Reliability!P$19:P$40,MATCH($CA2,Reliability!$C$19:$C$40,0)),0),0)*$R2)*$CE2,$J2)*$BY2","v":0},{"$f":"MIN((IFERROR(IF(AND($CC2<=CT$1,$CD2>=CT$1),INDEX(Reliability!Q$19:Q$40,MATCH($BZ2,Reliability!$C$19:$C$40,0)),0),0)*IF($CA2=\"n/a\",$J2,$P2)+IFERROR(IF(AND($CC2<=CT$1,$CD2>=CT$1),INDEX(Reliability!Q$19:Q$40,MATCH($CA2,Reliability!$C$19:$C$40,0)),0),0)*$R2)*$CE2,$J2)*$BY2","v":0},{"$f":"MIN((IFERROR(IF(AND($CC2<=CU$1,$CD2>=CU$1),INDEX(Reliability!R$19:R$40,MATCH($BZ2,Reliability!$C$19:$C$40,0)),0),0)*IF($CA2=\"n/a\",$J2,$P2)+IFERROR(IF(AND($CC2<=CU$1,$CD2>=CU$1),INDEX(Reliability!R$19:R$40,MATCH($CA2,Reliability!$C$19:$C$40,0)),0),0)*$R2)*$CE2,$J2)*$BY2","v":0},{"$f":"MIN((IFERROR(IF(AND($CC2<=CV$1,$CD2>=CV$1),INDEX(Reliability!S$19:S$40,MATCH($BZ2,Reliability!$C$19:$C$40,0)),0),0)*IF($CA2=\"n/a\",$J2,$P2)+IFERROR(IF(AND($CC2<=CV$1,$CD2>=CV$1),INDEX(Reliability!S$19:S$40,MATCH($CA2,Reliability!$C$19:$C$40,0)),0),0)*$R2)*$CE2,$J2)*$BY2","v":0}]

{"sheet":"accepted_data_types","index":3,"n_rows":71,"n_cols":2,"rows_kept":71,"cut":false,"hidden":true,"merged":[]}
["Column Name","Required data type"]
["lse_unique_contract_id","string"]
["resource","string"]
["alternative_resource_name","string"]
["contract_status","string"]
["caiso_queue_position","string"]
{"$rows_left_out":66}
{"sheet":"resources","index":4,"n_rows":1789,"n_cols":7,"rows_kept":1789,"cut":false,"hidden":false,"merged":[]}
["resource","generator_name","MAXGEN","resolve_final_group","BAA_ID","supertype","elcc_type"]
["7STDRD_1_SOLAR1","SHAFTER SOLAR",20,"caiso_solar","CISO","physical","utility_pv"]
["ACACIA_6_SOLAR","WEST ANTELOPE SOLAR",20,"caiso_solar","CISO","physical","utility_pv"]
["ADELANTO_SOLAR","NAN",10,"ldwp_solar","LADWP","physical","n/a"]
["ADERA_1_SOLAR1","ADERA SOLAR",20,"caiso_solar","CISO","physical","utility_pv"]
["ADLIN_1_UNITS","GEYSERS AIDLIN AGGREGATE",22,"caiso_geothermal","CISO","physical","geothermal"]
{"$rows_left_out":1784}
{"sheet":"lse_names","index":5,"n_rows":101,"n_cols":4,"rows_kept":101,"cut":false,"hidden":false,"merged":[]}
["lse","NAME","lse_type","lse_mmt_choice"]
["3PR","3 Phases Renewables","ESP"]
["APN","American PowerNet Management","ESP"]
["AVCE","Apple Valley Choice Energy","CCA"]
["CEI","Just Energy Solutions","ESP"]
["CES","Commercial Energy of Montana","ESP"]
{"$rows_left_out":96}
{"sheet":"misc","index":6,"n_rows":93,"n_cols":54,"rows_kept":93,"cut":false,"hidden":false,"merged":[]}
["contract_status","bool","yes_no","Year","int_count","transact","cap_areas","cap_sub_areas","state_county","d1911016_tranches","d2106035_tranche ","energy_capacity_from_resource","Is_hybrid_or_colocated","csp_cat","hybrid_Paired_co_located","solar_Technology_sub_type","storage_Technology_sub_type","nqc_reporting_source","cam_d1911016_vamo_pcia",null,null,"30MMT ELCC (%)",null,null,null,null,null,null,null,null,null,null,null,null,null,null,null,null,"25MMT ELCC (%)"]
["Online",0,"YES","NA",0,"Buy","Humboldt",null,"AlpineCounty",null,null,"EnergyCapacity","NotHybrid","NA","NA","NA","Li","NA","CAM",null,null,"elcc_type",2021,2022,2023,2024,2025,2026,2027,2028,2029,2030,2031,2032,2033,2034,2035,null,"elcc_type",2021,2022,2023,2024,2025,2026,2027,2028,2029,2030,2031,2032,2033,2034,2035]
["PlannedExisting",1,"NO",1970,1,"Sell","NorthCoastNorthBay",null,"AmadorCounty",1,"2023_general","EnergyOnly","ExistingBiomassExistingStorage","Large Hydro (GWh)","paired","Fixed","Flow","In the contract","D.19-11-016",null,null,"in_state_wind",null,null,null,null,null,null,null,null,null,null,null,null,null,null,null,null,"in_state_wind"]
["Development",null,"NA",1971,2,null,"Sierra",null,"AlamedaCounty","1&2","2024_general","CapacityOnly","ExistingBiomassNewStorage","Imported Hydro (GWh)","co-located","Tracking ","Other","Calculated","VAMO",null,null,"out_of_state_wind",null,null,null,null,null,null,null,null,null,null,null,null,null,null,null,null,"out_of_state_wind"]
["PlannedNew",null,null,1972,3,null,"Stockton",null,"ButteCounty",2,"2025_general",null,"ExistingGeothermalExistingStorage","Nuclear (GWh)",null,null,null,null,"GHG-free PCIA",null,null,"offshore_wind",null,null,null,null,null,null,null,null,null,null,null,null,null,null,null,null,"offshore_wind"]
[null,null,null,1973,4,null,"GreaterBay",null,"CalaverasCounty","2&3","2023_ZE_gen_paired_dr",null,"ExistingGeothermalNewStorage","Biogas (GWh)",null,null,null,null,null,null,null,"utility_pv",null,null,null,null,null,null,null,null,null,null,null,null,null,null,null,null,"utility_pv"]
{"$rows_left_out":88}
{"sheet":"CPSReportSheet (2)","index":7,"n_rows":53,"n_cols":6,"rows_kept":53,"cut":false,"hidden":true,"merged":[]}
[]
[null,"Resource",2024,2026,2030,2035]
[null,"Large Hydro",{"$f":"SUMIFS(unique_contracts!BQ:BQ,unique_contracts!$AF:$AF,\"<>sell\",unique_contracts!$BR:$BR,\"=\"&$B3,unique_contracts!$AQ:$AQ,\"<=\"&C$2,unique_contracts!$AT:$AT,\">=\"&C$2)","v":0},{"$f":"SUMIFS(unique_contracts!BR:BR,unique_contracts!$AF:$AF,\"<>sell\",unique_contracts!$BR:$BR,\"=\"&$B3,unique_contracts!$AQ:$AQ,\"<=\"&D$2,unique_contracts!$AT:$AT,\">=\"&D$2)","v":0},{"$f":"SUMIFS(unique_contracts!BS:BS,unique_contracts!$AF:$AF,\"<>sell\",unique_contracts!$BR:$BR,\"=\"&$B3,unique_contracts!$AQ:$AQ,\"<=\"&E$2,unique_contracts!$AT:$AT,\">=\"&E$2)","v":0},{"$f":"SUMIFS(unique_contracts!BT:BT,unique_contracts!$AF:$AF,\"<>sell\",unique_contracts!$BR:$BR,\"=\"&$B3,unique_contracts!$AQ:$AQ,\"<=\"&F$2,unique_contracts!$AT:$AT,\">=\"&F$2)","v":0}]
[null,"Imported Hydro",{"$f":"SUMIFS(unique_contracts!BQ:BQ,unique_contracts!$AF:$AF,\"<>sell\",unique_contracts!$BR:$BR,\"=\"&$B4,unique_contracts!$AQ:$AQ,\"<=\"&C$2,unique_contracts!$AT:$AT,\">=\"&C$2)","v":0},{"$f":"SUMIFS(unique_contracts!BR:BR,unique_contracts!$AF:$AF,\"<>sell\",unique_contracts!$BR:$BR,\"=\"&$B4,unique_contracts!$AQ:$AQ,\"<=\"&D$2,unique_contracts!$AT:$AT,\">=\"&D$2)","v":0},{"$f":"SUMIFS(unique_contracts!BS:BS,unique_contracts!$AF:$AF,\"<>sell\",unique_contracts!$BR:$BR,\"=\"&$B4,unique_contracts!$AQ:$AQ,\"<=\"&E$2,unique_contracts!$AT:$AT,\">=\"&E$2)","v":0},{"$f":"SUMIFS(unique_contracts!BT:BT,unique_contracts!$AF:$AF,\"<>sell\",unique_contracts!$BR:$BR,\"=\"&$B4,unique_contracts!$AQ:$AQ,\"<=\"&F$2,unique_contracts!$AT:$AT,\">=\"&F$2)","v":0}]
[null,"Nuclear",{"$f":"SUMIFS(unique_contracts!BQ:BQ,unique_contracts!$AF:$AF,\"<>sell\",unique_contracts!$BR:$BR,\"=\"&$B5,unique_contracts!$AQ:$AQ,\"<=\"&C$2,unique_contracts!$AT:$AT,\">=\"&C$2)","v":0},{"$f":"SUMIFS(unique_contracts!BR:BR,unique_contracts!$AF:$AF,\"<>sell\",unique_contracts!$BR:$BR,\"=\"&$B5,unique_contracts!$AQ:$AQ,\"<=\"&D$2,unique_contracts!$AT:$AT,\">=\"&D$2)","v":0},{"$f":"SUMIFS(unique_contracts!BS:BS,unique_contracts!$AF:$AF,\"<>sell\",unique_contracts!$BR:$BR,\"=\"&$B5,unique_contracts!$AQ:$AQ,\"<=\"&E$2,unique_contracts!$AT:$AT,\">=\"&E$2)","v":0},{"$f":"SUMIFS(unique_contracts!BT:BT,unique_contracts!$AF:$AF,\"<>sell\",unique_contracts!$BR:$BR,\"=\"&$B5,unique_contracts!$AQ:$AQ,\"<=\"&F$2,unique_contracts!$AT:$AT,\">=\"&F$2)","v":0}]
[null,"Biogas",{"$f":"SUMIFS(unique_contracts!BQ:BQ,unique_contracts!$AF:$AF,\"<>sell\",unique_contracts!$BR:$BR,\"=\"&$B6,unique_contracts!$AQ:$AQ,\"<=\"&C$2,unique_contracts!$AT:$AT,\">=\"&C$2)","v":0},{"$f":"SUMIFS(unique_contracts!BR:BR,unique_contracts!$AF:$AF,\"<>sell\",unique_contracts!$BR:$BR,\"=\"&$B6,unique_contracts!$AQ:$AQ,\"<=\"&D$2,unique_contracts!$AT:$AT,\">=\"&D$2)","v":0},{"$f":"SUMIFS(unique_contracts!BS:BS,unique_contracts!$AF:$AF,\"<>sell\",unique_contracts!$BR:$BR,\"=\"&$B6,unique_contracts!$AQ:$AQ,\"<=\"&E$2,unique_contracts!$AT:$AT,\">=\"&E$2)","v":0},{"$f":"SUMIFS(unique_contracts!BT:BT,unique_contracts!$AF:$AF,\"<>sell\",unique_contracts!$BR:$BR,\"=\"&$B6,unique_contracts!$AQ:$AQ,\"<=\"&F$2,unique_contracts!$AT:$AT,\">=\"&F$2)","v":0}]
{"$rows_left_out":48}
{"sheet":"Reliability","index":8,"n_rows":211,"n_cols":19,"rows_kept":211,"cut":false,"hidden":false,"merged":[]}
[]
[null,null,30,"MMT"]
[]
[]
[null,null,"Reliability Need"]
[null,null,null,null,2021,2022,2023,2024,2025,2026,2027,2028,2029,2030,2031,2032,2033,2034,2035]
{"$rows_left_out":206}
{"sheet":"CSPReportSheet","index":9,"n_rows":36,"n_cols":22,"rows_kept":36,"cut":false,"hidden":false,"merged":[[2,10,2,13],[2,14,2,17],[2,18,2,21],[1,10,1,21]]}
[]
[null,null,null,null,null,null,null,null,null,null,"NOTE: the below data is provided for troubleshooting purposes only."]
[null,null,null,null,null,null,null,null,null,null,"Bought/Owned",null,null,null,"Sold",null,null,null,"Net\n(GWh, MW, or MWh Energy Capacity)"]
[null,"Resource",2024,2026,2030,2035,"Units","Type",null,null,2024,2026,2030,2035,2024,2026,2030,2035,2024,2026,2030,2035]
[null,"Large Hydro",{"$f":"S5","v":0},{"$f":"T5","v":0},0,0,"GWh","GHG-Free",null,null,{"$f":"SUMIFS(unique_contracts!BQ:BQ,unique_contracts!$AB:$AB,\"<>sell\",unique_contracts!$BP:$BP,\"=\"&B5&\" (\"&G5&\")\",unique_contracts!$AM:$AM,\"<=\"&C$4,unique_contracts!$AP:$AP,\">=\"&C$4)","v":0},{"$f":"SUMIFS(unique_contracts!BR:BR,unique_contracts!$AB:$AB,\"<>sell\",unique_contracts!$BP:$BP,\"=\"&C5&\" (\"&H5&\")\",unique_contracts!$AM:$AM,\"<=\"&D$4,unique_contracts!$AP:$AP,\">=\"&D$4)","v":0},{"$f":"SUMIFS(unique_contracts!BS:BS,unique_contracts!$AB:$AB,\"<>sell\",unique_contracts!$BP:$BP,\"=\"&D5&\" (\"&I5&\")\",unique_contracts!$AM:$AM,\"<=\"&E$4,unique_contracts!$AP:$AP,\">=\"&E$4)","v":0},{"$f":"SUMIFS(unique_contracts!BT:BT,unique_contracts!$AB:$AB,\"<>sell\",unique_contracts!$BP:$BP,\"=\"&E5&\" (\"&J5&\")\",unique_contracts!$AM:$AM,\"<=\"&F$4,unique_contracts!$AP:$AP,\">=\"&F$4)","v":0},{"$f":"SUMIFS(unique_contracts!BQ:BQ,unique_contracts!$AB:$AB,\"=\"&\"Sell\",unique_contracts!$BP:$BP,\"=\"&B5&\" (\"&G5&\")\",unique_contracts!$AM:$AM,\"<=\"&C$4,unique_contracts!$AP:$AP,\">=\"&C$4)","v":0},{"$f":"SUMIFS(unique_contracts!BR:BR,unique_contracts!$AB:$AB,\"=\"&\"Sell\",unique_contracts!$BP:$BP,\"=\"&C5&\" (\"&H5&\")\",unique_contracts!$AM:$AM,\"<=\"&D$4,unique_contracts!$AP:$AP,\">=\"&D$4)","v":0},{"$f":"SUMIFS(unique_contracts!BS:BS,unique_contracts!$AB:$AB,\"=\"&\"Sell\",unique_contracts!$BP:$BP,\"=\"&D5&\" (\"&I5&\")\",unique_contracts!$AM:$AM,\"<=\"&E$4,unique_contracts!$AP:$AP,\">=\"&E$4)","v":0},{"$f":"SUMIFS(unique_contracts!BT:BT,unique_contracts!$AB:$AB,\"=\"&\"Sell\",unique_contracts!$BP:$BP,\"=\"&E5&\" (\"&J5&\")\",unique_contracts!$AM:$AM,\"<=\"&F$4,unique_contracts!$AP:$AP,\">=\"&F$4)","v":0},{"$f":"K5-O5","v":0},{"$f":"L5-P5","v":0},0,0]
[null,"Imported Hydro",{"$f":"S6","v":0},{"$f":"T6","v":0},{"$f":"U6","v":0},{"$f":"V6","v":0},"GWh","GHG-Free",null,null,{"$f":"SUMIFS(unique_contracts!BQ:BQ,unique_contracts!$AB:$AB,\"<>sell\",unique_contracts!$BP:$BP,\"=\"&B6&\" (\"&G6&\")\",unique_contracts!$AM:$AM,\"<=\"&C$4,unique_contracts!$AP:$AP,\">=\"&C$4)","v":0},{"$f":"SUMIFS(unique_contracts!BR:BR,unique_contracts!$AB:$AB,\"<>sell\",unique_contracts!$BP:$BP,\"=\"&C6&\" (\"&H6&\")\",unique_contracts!$AM:$AM,\"<=\"&D$4,unique_contracts!$AP:$AP,\">=\"&D$4)","v":0},{"$f":"SUMIFS(unique_contracts!BS:BS,unique_contracts!$AB:$AB,\"<>sell\",unique_contracts!$BP:$BP,\"=\"&D6&\" (\"&I6&\")\",unique_contracts!$AM:$AM,\"<=\"&E$4,unique_contracts!$AP:$AP,\">=\"&E$4)","v":0},{"$f":"SUMIFS(unique_contracts!BT:BT,unique_contracts!$AB:$AB,\"<>sell\",unique_contracts!$BP:$BP,\"=\"&E6&\" (\"&J6&\")\",unique_contracts!$AM:$AM,\"<=\"&F$4,unique_contracts!$AP:$AP,\">=\"&F$4)","v":0},{"$f":"SUMIFS(unique_contracts!BQ:BQ,unique_contracts!$AB:$AB,\"=\"&\"Sell\",unique_contracts!$BP:$BP,\"=\"&B6&\" (\"&G6&\")\",unique_contracts!$AM:$AM,\"<=\"&C$4,unique_contracts!$AP:$AP,\">=\"&C$4)","v":0},{"$f":"SUMIFS(unique_contracts!BR:BR,unique_contracts!$AB:$AB,\"=\"&\"Sell\",unique_contracts!$BP:$BP,\"=\"&C6&\" (\"&H6&\")\",unique_contracts!$AM:$AM,\"<=\"&D$4,unique_contracts!$AP:$AP,\">=\"&D$4)","v":0},{"$f":"SUMIFS(unique_contracts!BS:BS,unique_contracts!$AB:$AB,\"=\"&\"Sell\",unique_contracts!$BP:$BP,\"=\"&D6&\" (\"&I6&\")\",unique_contracts!$AM:$AM,\"<=\"&E$4,unique_contracts!$AP:$AP,\">=\"&E$4)","v":0},{"$f":"SUMIFS(unique_contracts!BT:BT,unique_contracts!$AB:$AB,\"=\"&\"Sell\",unique_contracts!$BP:$BP,\"=\"&E6&\" (\"&J6&\")\",unique_contracts!$AM:$AM,\"<=\"&F$4,unique_contracts!$AP:$AP,\">=\"&F$4)","v":0},{"$f":"K6-O6","v":0},{"$f":"L6-P6","v":0},{"$f":"M6-Q6","v":0},{"$f":"N6-R6","v":0}]
{"$rows_left_out":31}
{"sheet":"ReportSheet","index":10,"n_rows":1,"n_cols":9,"rows_kept":1,"cut":false,"hidden":false,"merged":[]}
["Duplicated Contract IDs:","unique_contracts invlid resource error rows:","Rows missing required project viability associated data:","Rows missing required hybrid associated data:","Supertype Case Error or Null Rows:","Supertype Contract Status Error or Null Rows:","Transaction counterparty error rows:","Rows missing CSP GHh:","Rows missing MTR NQC:"]